{"text_format":"1","workbook":"xlsx","n_sheets":2,"sheets":["CapitalSeguro","Calculo"],"not_rendered":{"charts":1,"images":2,"macros":1,"external_links":0,"defined_names":7,"comments":1,"pivot_tables":0},"unopened":[],"bounds":{"document_bytes":16777216,"sheet_cells":100000,"rows_first":2000,"rows_last":500,"rows_between":2000,"halvings":0,"cell_chars":16384,"cell_head_chars":4096},"cells_cut":0,"cells_raw":0,"read":"whole","date_system":"1900"}

{"sheet":"CapitalSeguro","index":0,"n_rows":86,"n_cols":34,"rows_kept":86,"cut":false,"hidden":false,"merged":[[67,26,67,32],[66,33,66,37],[67,33,67,37],[43,26,43,32],[44,26,44,32],[45,26,45,32],[46,26,46,32],[47,26,47,32],[48,26,48,32],[49,26,49,32],[50,26,50,32],[51,26,51,32],[52,26,52,32],[53,26,53,32],[54,26,54,32],[55,26,55,32],[56,26,56,32],[57,26,57,32],[58,26,58,32],[59,26,59,32],[60,26,60,32],[61,26,61,32],[62,26,62,32],[63,26,63,32],[64,26,64,32],[67,20,67,24],[43,33,43,37],[44,33,44,37],[45,33,45,37],[46,33,46,37],[48,33,48,37],[47,33,47,37],[49,33,49,37],[51,33,51,37],[50,33,50,37],[52,33,52,37],[54,33,54,37],[53,33,53,37],[55,33,55,37],[56,33,56,37],[57,33,57,37],[58,33,58,37],[59,33,59,37],[60,33,60,37],[61,33,61,37],[62,33,62,37],[63,33,63,37],[64,33,64,37],[65,33,65,37],[67,13,67,19],[64,13,64,19],[43,20,43,24],[44,20,44,24],[45,20,45,24],[46,20,46,24],[47,20,47,24],[48,20,48,24],[49,20,49,24],[50,20,50,24],[51,20,51,24],[52,20,52,24],[53,20,53,24],[54,20,54,24],[55,20,55,24],[56,20,56,24],[57,20,57,24],[58,20,58,24],[59,20,59,24],[60,20,60,24],[61,20,61,24],[62,20,62,24],[63,20,63,24],[62,6,62,9],[63,6,63,9],[64,6,64,9],[65,6,65,9],[66,6,66,9],[67,6,67,9],[43,13,43,19],[44,13,44,19],[45,13,45,19],[46,13,46,19],[47,13,47,19],[48,13,48,19],[49,13,49,19],[50,13,50,19],[51,13,51,19],[52,13,52,19],[53,13,53,19],[54,13,54,19],[55,13,55,19],[56,13,56,19],[57,13,57,19],[58,13,58,19],[59,13,59,19],[60,13,60,19],[60,10,60,12],[61,10,61,12],[62,10,62,12],[63,10,63,12],[64,10,64,12],[65,10,65,12],[44,6,44,9],[45,6,45,9],[46,6,46,9],[47,6,47,9],[48,6,48,9],[49,6,49,9],[50,6,50,9],[51,6,51,9],[52,6,52,9],[53,6,53,9],[54,6,54,9],[55,6,55,9],[56,6,56,9],[57,6,57,9],[58,6,58,9],[59,6,59,9],[60,6,60,9],[61,6,61,9],[73,18,73,21],[66,10,66,12],[67,10,67,12],[61,13,61,19],[62,13,62,19],[63,13,63,19],[38,13,38,24],[38,26,38,37],[39,6,41,9],[39,10,41,12],[39,13,41,19],[39,20,41,24],[39,26,41,32],[39,33,41,37],[43,10,43,12],[43,6,43,9],[44,10,44,12],[45,10,45,12],[46,10,46,12],[47,10,47,12],[48,10,48,12],[49,10,49,12],[50,10,50,12],[51,10,51,12],[82,27,82,31],[82,22,82,26],[83,39,83,44],[83,33,83,38],[83,27,83,31],[83,22,83,26],[82,18,82,21],[80,27,80,31],[80,33,80,38],[80,39,80,44],[81,33,81,38],[81,39,81,44],[82,39,82,44],[82,33,82,38],[84,27,84,31],[84,33,84,38],[84,39,84,44],[85,5,85,7],[85,8,85,9],[85,10,85,13],[85,14,85,17],[85,18,85,21],[85,22,85,26],[85,27,85,31],[84,5,84,7],[84,8,84,9],[84,10,84,13],[84,14,84,17],[84,18,84,21],[84,22,84,26],[86,39,86,44],[91,27,91,45],[85,33,85,38],[85,39,85,44],[86,5,86,7],[86,8,86,9],[86,10,86,13],[86,14,86,17],[86,18,86,21],[86,22,86,26],[86,27,86,31],[86,33,86,38],[83,5,83,7],[83,8,83,9],[83,10,83,13],[83,14,83,17],[83,18,83,21],[82,5,82,7],[82,8,82,9],[82,10,82,13],[82,14,82,17],[81,5,81,7],[81,8,81,9],[81,10,81,13],[81,14,81,17],[81,18,81,21],[81,22,81,26],[81,27,81,31],[80,5,80,7],[80,8,80,9],[80,10,80,13],[80,14,80,17],[80,18,80,21],[80,22,80,26],[79,5,79,7],[79,8,79,9],[79,10,79,13],[79,14,79,17],[79,18,79,21],[79,22,79,26],[79,27,79,31],[79,33,79,38],[79,39,79,44],[78,5,78,7],[78,8,78,9],[78,10,78,13],[78,14,78,17],[78,18,78,21],[77,5,77,7],[77,8,77,9],[77,10,77,13],[77,14,77,17],[77,18,77,21],[72,5,72,7],[72,8,72,9],[72,10,72,13],[72,14,72,17],[72,18,72,21],[76,5,76,7],[76,8,76,9],[76,10,76,13],[76,14,76,17],[76,18,76,21],[75,5,75,7],[75,8,75,9],[75,10,75,13],[75,14,75,17],[75,18,75,21],[74,5,74,7],[74,8,74,9],[74,10,74,13],[74,14,74,17],[74,18,74,21],[73,5,73,7],[73,8,73,9],[73,10,73,13],[73,14,73,17],[11,30,11,32],[11,33,11,38],[15,30,15,32],[15,33,15,38],[69,5,69,7],[68,5,68,7],[71,5,71,7],[71,8,71,9],[71,10,71,13],[71,14,71,17],[71,18,71,21],[70,5,70,7],[70,8,70,9],[70,10,70,13],[70,14,70,17],[70,18,70,21],[53,10,53,12],[54,10,54,12],[55,10,55,12],[56,10,56,12],[52,10,52,12],[57,10,57,12],[58,10,58,12],[59,10,59,12],[65,13,65,19],[66,13,66,19],[64,20,64,24],[65,20,65,24],[66,20,66,24],[65,26,65,32],[66,26,66,32],[70,26,70,41],[7,2,8,46],[10,3,10,5],[11,3,11,16],[11,21,11,24],[12,3,12,9],[12,21,12,23],[16,21,16,24],[16,3,16,9],[16,12,16,17],[32,8,32,13],[12,30,12,32],[12,33,12,38],[13,30,13,32],[13,33,13,38],[14,30,14,32],[14,33,14,38]]}
[]
[]
[]
[]
[]
[]
[]
[null,null,"Old Mutual | Capital Seguro"]
[]
[]
[null,null,null,"Datos",null,null,null,null,null,null,null,null,null,null,null,null,null,null,null,null,null,null,null,null,null,null,null,null,null,null,"Aportaciones Adicionales"]
[null,null,null,null,null,null,null,null,null,null,null,null,null,null,null,null,null,null,null,null,null,45,null,null,null,null,null,null,null,null,"Año",null,null,"Monto"]
[null,null,null,"Nombre",null,null,null,null,null,null,null,null,null,null,null,null,null,null,null,null,null,"Edad"]
[]
[]
[null,null,null,"Características de la Inversión Inicial"]
[null,null,null,600000,null,null,null,null,null,null,null,null,"Especulativo",null,null,null,null,null,null,null,null,25]
[null,null,null,"Monto",null,null,null,null,null,null,null,null,"Portafolio de Inversión (*)",null,null,null,null,null,null,null,null,"Término"]
[]
[]
{"$rows_left_out":67}
{"sheet":"Calculo","index":1,"n_rows":302,"n_cols":48,"rows_kept":302,"cut":false,"hidden":true,"merged":[[0,45,0,47],[74,0,85,0],[86,0,97,0],[98,0,109,0],[110,0,121,0],[0,30,0,33],[14,0,25,0],[26,0,37,0],[38,0,49,0],[50,0,61,0],[62,0,73,0],[0,35,0,36],[4,30,4,33],[2,30,2,32],[3,30,3,32],[2,0,13,0],[122,0,133,0],[134,0,145,0],[146,0,157,0],[158,0,169,0],[170,0,181,0],[182,0,193,0],[194,0,205,0],[206,0,217,0],[218,0,229,0],[230,0,241,0],[242,0,253,0],[254,0,265,0],[266,0,277,0],[278,0,289,0],[290,0,301,0]]}
["AÑO","Año2","Mes","Edad","Aportes","Monto Inversión","Cargo Inicial",null,"Valor de la cuenta rend minimo","Costo Variable","Saldo fin de mes sin costo fijo","Costo fijo","Saldo fin de mes menos costo fijo","Saldo fin de mes menos costo fijo+bono perm","Ganancia","Seguro de Vida rend minimo","Beneficio por Fallecimiento rend minimo",null,"Valor de la cuenta rend maximo","Costo Variable","Saldo fin de mes sin costo fijo","Costo Fijo","Saldo fin de mes menos costo fijo","Saldo fin de mes menos costo fijo+bono perm","Seguro de vida rend maximo","Beneficio por Fallecimiento rend maximo",null,null,null,null,"Cargos",null,null,null,null,"Rendimiento anual",null,"Mensualizado",null,"Combo Edad","Combo Portafolio","Rend. Min","Rend. Max","Combo Termino",null,"Relativo a la inversion"]
[0,null,0,{"$f":"edad","v":45},0,{"$f":"E2","v":0},null,null,0,0,0,0,0,null,null,null,null,null,0,0,0,0]
[1,1,1,{"$f":"$D$2+(B3-1)","v":45},{"$f":"invinicial","v":600000},{"$f":"E3+F2","v":600000},{"$f":"F3*($AH$3)","v":15000},null,{"$f":"(N2+E3-G3)*(1+$AL$3)","v":589664.87215090869},{"$f":"IF(AND(invinicial>=$AE$7,invinicial<$AF$7),I3*$AH$7,IF(AND(invinicial>=$AE$8,invinicial<$AF$8),I3*$AH$8,IF(AND(invinicial>=$AE$9,invinicial<$AF$9),I3*$AH$9,IF(invinicial>=$AE$10,I3*$AH$10,\"Error\"))))","v":294.83243607545432},{"$f":"I3-J3","v":589370.03971483326},{"$f":"IF(B3*12=C3,$AH$4,0)","v":0},{"$f":"K3-L3","v":589370.03971483326},{"$f":"IF(C3=36,M3+bonopermconv,M3)","v":589370.03971483326},{"$f":"N3-F3","v":-10629.960285166744},{"$f":"MIN(2000000,IF(D3<$AU$4,N3*$AV$4,IF(AND(D3>=$AT$5,D3<=$AU$5),N3*$AV$5,IF(D3>$AT$6,N3*$AV$6,\"\"))))","v":1178740.0794296665},{"$f":"P3+N3","v":1768110.1191444998},null,{"$f":"(X2+E3-G3)*(1+$AL$4)","v":590550.94386673113},{"$f":"IF(AND(invinicial>=$AE$7,invinicial<$AF$7),S3*$AH$7,IF(AND(invinicial>=$AE$8,invinicial<$AF$8),S3*$AH$8,IF(AND(invinicial>=$AE$9,invinicial<$AF$9),S3*$AH$9,IF(invinicial>=$AE$10,S3*$AH$10,\"Error\"))))","v":295.27547193336557},{"$f":"S3-T3","v":590255.66839479771},{"$f":"IF(C3=B3*12,$AH$4,0)","v":0},{"$f":"U3-V3","v":590255.66839479771},{"$f":"IF(C3=36,W3+bonopermopt,W3)","v":590255.66839479771},{"$f":"MIN(2000000,IF(D3<$AU$4,X3*$AV$4,IF(AND(D3>=$AT$5,D3<=$AU$5),X3*$AV$5,IF(D3>$AT$6,X3*$AV$6,\"\"))))","v":1180511.3367895954},{"$f":"Y3+X3","v":1770767.0051843931},null,null,null,null,"Inicial",null,null,2.5000000000000001E-2,null,"Minimo",{"$f":"VLOOKUP(CapitalSeguro!$M$17,Calculo!$AO$3:$AQ$6,2,FALSE)","v":0.1},{"$f":"((1+$AK$3)^(1/12))-1","v":7.9741404289037643E-3},null,18,"Estabilidad",0.06,0.08,10,null,"Edad min","Edad Max","Valor de cuenta X"]
[null,1,{"$f":"C3+1","v":2},{"$f":"$D$2+(B4-1)","v":45},{"$f":"IF((((CapitalSeguro!$AE$13-1)*12)+1)=Calculo!C4,CapitalSeguro!$AH$13,0)+IF((((CapitalSeguro!$AE$14-1)*12)+1)=Calculo!C4,CapitalSeguro!$AH$14,0)+IF((((CapitalSeguro!$AE$15-1)*12)+1)=Calculo!C4,CapitalSeguro!$AH$15,0)+IF((((CapitalSeguro!$AE$16-1)*12)+1)=Calculo!C4,CapitalSeguro!$AH$16,0)","v":0},{"$f":"E4+F3","v":600000},0,null,{"$f":"(N3+E4-G4)*(1+$AL$3)","v":594069.75917610794},297.03487958805397,{"$f":"I4-J4","v":593772.72429651988},{"$f":"IF(B4*12=C4,$AH$4,0)","v":0},{"$f":"K4-L4","v":593772.72429651988},593772.72429651988,{"$f":"N4-F4","v":-6227.275703480118},1187545.4485930398,{"$f":"P4+N4","v":1781318.1728895595},null,{"$f":"(X3+E4-G4)*(1+$AL$4)","v":595856.48221065989},{"$f":"IF(AND(invinicial>=$AE$7,invinicial<$AF$7),S4*$AH$7,IF(AND(invinicial>=$AE$8,invinicial<$AF$8),S4*$AH$8,IF(AND(invinicial>=$AE$9,invinicial<$AF$9),S4*$AH$9,IF(invinicial>=$AE$10,S4*$AH$10,\"Error\"))))","v":297.92824110532996},595558.5539695546,{"$f":"IF(C4=B4*12,$AH$4,0)","v":0},{"$f":"U4-V4","v":595558.5539695546},595558.5539695546,{"$f":"MIN(2000000,IF(D4<$AU$4,X4*$AV$4,IF(AND(D4>=$AT$5,D4<=$AU$5),X4*$AV$5,IF(D4>$AT$6,X4*$AV$6,\"\"))))","v":1191117.1079391092},{"$f":"Y4+X4","v":1786675.6619086638},null,null,null,null,"Fijo Anual",null,null,274,null,"Maximo",{"$f":"VLOOKUP(CapitalSeguro!$M$17,Calculo!$AO$3:$AQ$6,3,FALSE)","v":0.12},{"$f":"((1+$AK$4)^(1/12))-1","v":9.4887929345830457E-3},null,19,"Moderado",7.0000000000000007E-2,0.09,11,null,null,55,2]
[null,1,{"$f":"C4+1","v":3},45,{"$f":"IF((((CapitalSeguro!$AE$13-1)*12)+1)=Calculo!C5,CapitalSeguro!$AH$13,0)+IF((((CapitalSeguro!$AE$14-1)*12)+1)=Calculo!C5,CapitalSeguro!$AH$14,0)+IF((((CapitalSeguro!$AE$15-1)*12)+1)=Calculo!C5,CapitalSeguro!$AH$15,0)+IF((((CapitalSeguro!$AE$16-1)*12)+1)=Calculo!C5,CapitalSeguro!$AH$16,0)","v":0},600000,0,null,598507.55138291314,299.25377569145655,598208.29760722164,{"$f":"IF(B5*12=C5,$AH$4,0)","v":0},598208.29760722164,598208.29760722164,-1791.7023927783594,1196416.5952144433,1794624.8928216649,null,601209.68576859136,300.60484288429569,600909.08092570701,0,600909.08092570701,600909.08092570701,1201818.161851414,1802727.242777121,null,null,null,null,"Relativo a la inversion",null,null,null,null,null,null,null,null,20,"Dinámico",0.08,0.1,12,null,55,60,1]
[null,1,4,45,{"$f":"IF((((CapitalSeguro!$AE$13-1)*12)+1)=Calculo!C6,CapitalSeguro!$AH$13,0)+IF((((CapitalSeguro!$AE$14-1)*12)+1)=Calculo!C6,CapitalSeguro!$AH$14,0)+IF((((CapitalSeguro!$AE$15-1)*12)+1)=Calculo!C6,CapitalSeguro!$AH$15,0)+IF((((CapitalSeguro!$AE$16-1)*12)+1)=Calculo!C6,CapitalSeguro!$AH$16,0)","v":0},600000,0,null,602978.49457807711,301.48924728903859,602677.00533078809,0,602677.00533078809,602677.00533078809,2677.005330788088,1205354.0106615762,1808031.0159923644,null,606610.98276712163,303.30549138356082,606307.6772757381,0,606307.6772757381,606307.6772757381,1212615.3545514762,1818923.0318272142,null,null,null,null,"Min","Max","Cargo anual","Mensualizado",null,null,null,null,null,21,"Especulativo",0.1,0.12,13,null,60,null,0.01]
[null,1,5,45,{"$f":"IF((((CapitalSeguro!$AE$13-1)*12)+1)=Calculo!C7,CapitalSeguro!$AH$13,0)+IF((((CapitalSeguro!$AE$14-1)*12)+1)=Calculo!C7,CapitalSeguro!$AH$14,0)+IF((((CapitalSeguro!$AE$15-1)*12)+1)=Calculo!C7,CapitalSeguro!$AH$15,0)+IF((((CapitalSeguro!$AE$16-1)*12)+1)=Calculo!C7,CapitalSeguro!$AH$16,0)","v":0},600000,0,null,607482.836404567,303.74141820228351,607179.09498636471,0,607179.09498636471,607179.09498636471,7179.0949863647111,1214358.1899727294,1821537.2849590941,null,612060.80528005562,306.03040264002783,611754.77487741562,0,611754.77487741562,611754.77487741562,1223509.5497548312,1835264.324632247,null,null,null,null,50000,75000,1.4999999999999999E-2,{"$f":"AG7/12","v":1.25E-3},null,null,null,null,null,22,null,null,null,14]
[null,1,6,45,{"$f":"IF((((CapitalSeguro!$AE$13-1)*12)+1)=Calculo!C8,CapitalSeguro!$AH$13,0)+IF((((CapitalSeguro!$AE$14-1)*12)+1)=Calculo!C8,CapitalSeguro!$AH$14,0)+IF((((CapitalSeguro!$AE$15-1)*12)+1)=Calculo!C8,CapitalSeguro!$AH$15,0)+IF((((CapitalSeguro!$AE$16-1)*12)+1)=Calculo!C8,CapitalSeguro!$AH$16,0)","v":0},600000,0,null,612020.8263552807,306.01041317764037,611714.81594210304,0,611714.81594210304,611714.81594210304,11714.815942103043,1223429.6318842061,1835144.4478263091,null,617559.58926296991,308.77979463148495,617250.80946833838,0,617250.80946833838,617250.80946833838,1234501.6189366768,1851752.4284050153,null,null,null,null,75000,500000,0.01,{"$f":"AG8/12","v":8.3333333333333339E-4},null,null,null,null,null,23,null,null,null,15]
[null,1,7,45,{"$f":"IF((((CapitalSeguro!$AE$13-1)*12)+1)=Calculo!C9,CapitalSeguro!$AH$13,0)+IF((((CapitalSeguro!$AE$14-1)*12)+1)=Calculo!C9,CapitalSeguro!$AH$14,0)+IF((((CapitalSeguro!$AE$15-1)*12)+1)=Calculo!C9,CapitalSeguro!$AH$15,0)+IF((((CapitalSeguro!$AE$16-1)*12)+1)=Calculo!C9,CapitalSeguro!$AH$16,0)","v":0},600000,0,null,616592.71578686638,308.2963578934332,616284.41942897299,0,616284.41942897299,616284.41942897299,16284.419428972993,1232568.838857946,1848853.258286919,null,623107.77458808722,311.55388729404359,622796.2207007932,0,622796.2207007932,622796.2207007932,1245592.4414015864,1868388.6621023796,null,null,null,null,500000,1000000,6.0000000000000001E-3,5.0000000000000001E-4,null,null,null,null,null,24,null,null,null,16]
[null,1,8,45,{"$f":"IF((((CapitalSeguro!$AE$13-1)*12)+1)=Calculo!C10,CapitalSeguro!$AH$13,0)+IF((((CapitalSeguro!$AE$14-1)*12)+1)=Calculo!C10,CapitalSeguro!$AH$14,0)+IF((((CapitalSeguro!$AE$15-1)*12)+1)=Calculo!C10,CapitalSeguro!$AH$15,0)+IF((((CapitalSeguro!$AE$16-1)*12)+1)=Calculo!C10,CapitalSeguro!$AH$16,0)","v":0},600000,0,null,621198.75793364504,310.59937896682254,620888.1585546782,0,620888.1585546782,620888.1585546782,20888.158554678201,1241776.3171093564,1862664.4756640345,null,628705.80507946387,314.35290253973193,628391.4521769241,0,628391.4521769241,628391.4521769241,1256782.9043538482,1885174.3565307723,null,null,null,null,1000000,null,2E-3,1.6666666666666666E-4,null,null,null,null,null,25,null,null,null,17]
[null,1,9,45,{"$f":"IF((((CapitalSeguro!$AE$13-1)*12)+1)=Calculo!C11,CapitalSeguro!$AH$13,0)+IF((((CapitalSeguro!$AE$14-1)*12)+1)=Calculo!C11,CapitalSeguro!$AH$14,0)+IF((((CapitalSeguro!$AE$15-1)*12)+1)=Calculo!C11,CapitalSeguro!$AH$15,0)+IF((((CapitalSeguro!$AE$16-1)*12)+1)=Calculo!C11,CapitalSeguro!$AH$16,0)","v":0},600000,0,null,625839.20792163664,312.91960396081834,625526.28831767582,0,625526.28831767582,625526.28831767582,25526.288317675819,1251052.5766353516,1876578.8649530276,null,634354.12854849291,317.17706427424645,634036.95148421871,0,634036.95148421871,634036.95148421871,1268073.9029684374,1902110.8544526561,null,null,null,null,null,null,null,null,null,null,null,null,null,26,null,null,null,18]
[null,1,10,45,{"$f":"IF((((CapitalSeguro!$AE$13-1)*12)+1)=Calculo!C12,CapitalSeguro!$AH$13,0)+IF((((CapitalSeguro!$AE$14-1)*12)+1)=Calculo!C12,CapitalSeguro!$AH$14,0)+IF((((CapitalSeguro!$AE$15-1)*12)+1)=Calculo!C12,CapitalSeguro!$AH$15,0)+IF((((CapitalSeguro!$AE$16-1)*12)+1)=Calculo!C12,CapitalSeguro!$AH$16,0)","v":0},600000,0,null,630514.32278269192,315.25716139134596,630199.0656213006,0,630199.0656213006,630199.0656213006,30199.0656213006,1260398.1312426012,1890597.1968639018,null,640053.19682972669,320.02659841486337,639733.17023131181,0,639733.17023131181,639733.17023131181,1279466.3404626236,1919199.5106939354,null,null,null,null,null,null,null,null,null,null,null,null,null,27,null,null,null,19]
[null,1,11,45,{"$f":"IF((((CapitalSeguro!$AE$13-1)*12)+1)=Calculo!C13,CapitalSeguro!$AH$13,0)+IF((((CapitalSeguro!$AE$14-1)*12)+1)=Calculo!C13,CapitalSeguro!$AH$14,0)+IF((((CapitalSeguro!$AE$15-1)*12)+1)=Calculo!C13,CapitalSeguro!$AH$15,0)+IF((((CapitalSeguro!$AE$16-1)*12)+1)=Calculo!C13,CapitalSeguro!$AH$16,0)","v":0},600000,0,null,635224.36146872875,317.61218073436436,634906.74928799435,0,634906.74928799435,634906.74928799435,34906.749287994346,1269813.4985759887,1904720.247863983,null,645803.46581702109,322.90173290851055,645480.56408411253,0,645480.56408411253,645480.56408411253,1290961.1281682251,1936441.6922523375,null,null,null,null,"Bono de Permanencia (escenario conservador)",null,null,null,null,{"$f":"(AVERAGE($M$3:$M$38)*$AH$3)+(aporteadic2*2/3*2.5%)+(aportadic3*1/3*2.5%)","v":16826.061743195263},null,null,null,28,null,null,null,20]
[null,1,12,45,{"$f":"IF((((CapitalSeguro!$AE$13-1)*12)+1)=Calculo!C14,CapitalSeguro!$AH$13,0)+IF((((CapitalSeguro!$AE$14-1)*12)+1)=Calculo!C14,CapitalSeguro!$AH$14,0)+IF((((CapitalSeguro!$AE$15-1)*12)+1)=Calculo!C14,CapitalSeguro!$AH$15,0)+IF((((CapitalSeguro!$AE$16-1)*12)+1)=Calculo!C14,CapitalSeguro!$AH$16,0)","v":0},600000,0,null,639969.58486607566,319.98479243303785,639649.60007364268,274,639375.60007364268,639375.60007364268,39375.600073642679,1278751.2001472854,1918126.8002209282,null,651605.39550000452,325.80269775000227,651279.59280225448,274,651005.59280225448,651005.59280225448,1302011.185604509,1953016.7784067634,null,null,null,null,"Bono de Permanencia (escenario optimista)",null,null,null,null,{"$f":"AVERAGE($W$3:$W$38)*$AH$3+(aporteadic2*2/3*2.5%)+(aportadic3*1/3*2.5%)","v":17323.081027162898},null,null,null,29,null,null,null,21]
[2,2,13,46,{"$f":"IF((((CapitalSeguro!$AE$13-1)*12)+1)=Calculo!C15,CapitalSeguro!$AH$13,0)+IF((((CapitalSeguro!$AE$14-1)*12)+1)=Calculo!C15,CapitalSeguro!$AH$14,0)+IF((((CapitalSeguro!$AE$15-1)*12)+1)=Calculo!C15,CapitalSeguro!$AH$15,0)+IF((((CapitalSeguro!$AE$16-1)*12)+1)=Calculo!C15,CapitalSeguro!$AH$16,0)","v":0},600000,0,null,644474.07089544449,322.23703544772223,644151.83385999675,0,644151.83385999675,644151.83385999675,44151.833859996754,1288303.6677199935,1932455.5015799901,null,657182.85007161053,328.59142503580529,656854.25864657469,0,656854.25864657469,656854.25864657469,1313708.5172931494,1970562.7759397239,null,null,null,null,null,null,null,null,null,null,null,null,null,30,null,null,null,22]
[null,2,14,46,{"$f":"IF((((CapitalSeguro!$AE$13-1)*12)+1)=Calculo!C16,CapitalSeguro!$AH$13,0)+IF((((CapitalSeguro!$AE$14-1)*12)+1)=Calculo!C16,CapitalSeguro!$AH$14,0)+IF((((CapitalSeguro!$AE$15-1)*12)+1)=Calculo!C16,CapitalSeguro!$AH$15,0)+IF((((CapitalSeguro!$AE$16-1)*12)+1)=Calculo!C16,CapitalSeguro!$AH$16,0)","v":0},600000,0,null,649288.39104073227,324.64419552036617,648963.74684521195,0,648963.74684521195,648963.74684521195,48963.74684521195,1297927.4936904239,1946891.240535636,null,663087.01269507105,331.54350634753553,662755.46918872348,0,662755.46918872348,662755.46918872348,1325510.938377447,1988266.4075661704,null,null,null,null,null,null,null,null,null,null,null,null,null,31,null,null,null,23]
[null,2,15,46,{"$f":"IF((((CapitalSeguro!$AE$13-1)*12)+1)=Calculo!C17,CapitalSeguro!$AH$13,0)+IF((((CapitalSeguro!$AE$14-1)*12)+1)=Calculo!C17,CapitalSeguro!$AH$14,0)+IF((((CapitalSeguro!$AE$15-1)*12)+1)=Calculo!C17,CapitalSeguro!$AH$15,0)+IF((((CapitalSeguro!$AE$16-1)*12)+1)=Calculo!C17,CapitalSeguro!$AH$16,0)","v":0},600000,0,null,654138.67489582323,327.06933744791161,653811.60555837536,0,653811.60555837536,653811.60555837536,53811.605558375362,1307623.2111167507,1961434.8166751261,null,669044.21860211773,334.52210930105889,668709.69649281667,0,668709.69649281667,668709.69649281667,1337419.3929856333,2006129.0894784499,null,null,null,null,null,null,null,null,null,null,null,null,null,32,null,null,null,24]
[null,2,16,46,{"$f":"IF((((CapitalSeguro!$AE$13-1)*12)+1)=Calculo!C18,CapitalSeguro!$AH$13,0)+IF((((CapitalSeguro!$AE$14-1)*12)+1)=Calculo!C18,CapitalSeguro!$AH$14,0)+IF((((CapitalSeguro!$AE$15-1)*12)+1)=Calculo!C18,CapitalSeguro!$AH$15,0)+IF((((CapitalSeguro!$AE$16-1)*12)+1)=Calculo!C18,CapitalSeguro!$AH$16,0)","v":0},600000,0,null,659025.19111514487,329.51259555757247,658695.67851958727,0,658695.67851958727,658695.67851958727,58695.678519587265,1317391.3570391745,1976087.0355587618,null,675054.94433618488,337.52747216809246,674717.41686401679,0,674717.41686401679,674717.41686401679,1349434.8337280336,2024152.2505920504,null,null,null,null,null,null,null,null,null,null,null,null,null,33,null,null,null,25]
[null,2,17,46,{"$f":"IF((((CapitalSeguro!$AE$13-1)*12)+1)=Calculo!C19,CapitalSeguro!$AH$13,0)+IF((((CapitalSeguro!$AE$14-1)*12)+1)=Calculo!C19,CapitalSeguro!$AH$14,0)+IF((((CapitalSeguro!$AE$15-1)*12)+1)=Calculo!C19,CapitalSeguro!$AH$15,0)+IF((((CapitalSeguro!$AE$16-1)*12)+1)=Calculo!C19,CapitalSeguro!$AH$16,0)","v":0},600000,0,null,663948.21036001446,331.97410518000726,663616.23625483445,0,663616.23625483445,663616.23625483445,63616.236254834454,1327232.4725096689,1990848.7087645032,null,681119.67072199623,340.55983536099814,680779.11088663526,0,680779.11088663526,680779.11088663526,1361558.2217732705,2042337.3326599058,null,null,null,null,null,null,null,null,null,null,null,null,null,34]
[null,2,18,46,{"$f":"IF((((CapitalSeguro!$AE$13-1)*12)+1)=Calculo!C20,CapitalSeguro!$AH$13,0)+IF((((CapitalSeguro!$AE$14-1)*12)+1)=Calculo!C20,CapitalSeguro!$AH$14,0)+IF((((CapitalSeguro!$AE$15-1)*12)+1)=Calculo!C20,CapitalSeguro!$AH$15,0)+IF((((CapitalSeguro!$AE$16-1)*12)+1)=Calculo!C20,CapitalSeguro!$AH$16,0)","v":0},600000,0,null,668908.00531363103,334.45400265681553,668573.55131097417,0,668573.55131097417,668573.55131097417,68573.551310974173,1337147.1026219483,2005720.6539329225,null,687238.88290402805,343.61944145201403,686895.26346257608,0,686895.26346257608,686895.26346257608,1373790.5269251522,2060685.7903877283,null,null,null,null,null,null,null,null,null,null,null,null,null,35]
{"$rows_left_out":282}